Methanone,1-azulenylphenyl-
- Formula: C17H12O
- Molecular weight: 232.2766
- IUPAC Standard InChIKey: MDBBNEJBQWSHQB-UHFFFAOYSA-N
- CAS Registry Number: 38717-96-3
- Chemical structure:
View 3d structure (requires JavaScript / HTML 5) - Permanent link for this species. Use this link for bookmarking this species for future reference.

Gas phase ion energetics data

Data compiled by: Sharon G. Lias, Rhoda D. Levin, and Sherif A. Kafafi
Ionization energy determinations
IE (eV) | Method | Reference | Comment |
---|---|---|---|
7.55 | PE | Dougherty, Lewis, et al., 1980 | Vertical value |

References

Dougherty, Lewis, et al., 1980
Dougherty, D.; Lewis, J.; Nauman, R.V.; McGlynn, S.P.,
Photoelectron spectroscopy of azulenes,
J. Electron Spectrosc. Relat. Phenom., 1980, 19, 21. [all data]