1,3,5-Triazatricyclo[3.3.1.13,7]decane, 7-methyl-
- Formula: C8H15N3
- Molecular weight: 153.2248
- IUPAC Standard InChIKey: VMLZAFNEMDCWNF-UHFFFAOYSA-N
- CAS Registry Number: 38705-10-1
- Chemical structure:
View 3d structure (requires JavaScript / HTML 5) - Permanent link for this species. Use this link for bookmarking this species for future reference.

Gas phase ion energetics data

Data compiled as indicated in comments:
LLK - Sharon G. Lias, Rhoda D. Levin, and Sherif A. Kafafi
Ionization energy determinations
IE (eV) | Method | Reference | Comment |
---|---|---|---|
8.08 | PE | Nelsen and Buschek, 1974 | Vertical value; LLK |

References

Nelsen and Buschek, 1974
Nelsen, S.F.; Buschek, J.M.,
Photoelectron spectra of some cyclic di- and polyamines. Lone pair-lone pair interaction in 1,3- and 1,4-diamines,
J. Am. Chem. Soc., 1974, 96, 7930. [all data]