Pyridazine, hexahydro-1,2,3-trimethyl-
- Formula: C7H16N2
- Molecular weight: 128.2153
- IUPAC Standard InChIKey: UROGSVVZMFKBNA-UHFFFAOYSA-N
- CAS Registry Number: 38704-92-6
- Chemical structure:
View 3d structure (requires JavaScript / HTML 5) - Permanent link for this species. Use this link for bookmarking this species for future reference.

Gas phase ion energetics data

Data compiled as indicated in comments:
LBLHLM - Sharon G. Lias, John E. Bartmess, Joel F. Liebman, John L. Holmes, Rhoda D. Levin, and W. Gary Mallard
LLK - Sharon G. Lias, Rhoda D. Levin, and Sherif A. Kafafi
Ionization energy determinations
IE (eV) | Method | Reference | Comment |
---|---|---|---|
8.31 | PE | Nelsen, 1984 | Vertical value; LBLHLM |
7.83 | PE | Nelsen, Peacock, et al., 1976 | Vertical value; LLK |
8.03 | PE | Nelsen and Buschek, 1974 | Vertical value; LLK |
7.83 | PE | Nelsen and Buschek, 1974, 2 | Vertical value; LLK |
7.81 | PE | Nelsen, Buschek, et al., 1973 | Vertical value; LLK |

References

Nelsen, 1984
Nelsen, S.F.,
Ionization from nitrogen and oxygen lone pairs: A comparison of trialkylamine, dialkyl ether, tetraalkylhydrazine, and dialkyl peroxide photoelectron spectroscopic ionization potentials,
J. Org. Chem., 1984, 49, 1891. [all data]
Nelsen, Peacock, et al., 1976
Nelsen, S.F.; Peacock, V.; Weisman, G.R.,
Single-electron oxidation equilibria of tetraalkylhydrazines. Comparison of solution E° values and vapor-phase ionization potentials,
J. Am. Chem. Soc., 1976, 98, 5269. [all data]
Nelsen and Buschek, 1974
Nelsen, S.F.; Buschek, J.M.,
Photoelectron spectra of some cyclic di- and polyamines. Lone pair-lone pair interaction in 1,3- and 1,4-diamines,
J. Am. Chem. Soc., 1974, 96, 7930. [all data]
Nelsen and Buschek, 1974, 2
Nelsen, S.F.; Buschek, J.M.,
Photoelectron spectra of hydrazines. V. Pyrazolidine and hexahydropyridazine derivatives,
J. Am. Chem. Soc., 1974, 96, 6987. [all data]
Nelsen, Buschek, et al., 1973
Nelsen, S.F.; Buschek, J.M.; Hintz, P.J.,
Photoelectron spectra of hydrazines. II. Conformations of hexahydropyridazines,
J. Am. Chem. Soc., 1973, 95, 2013. [all data]