Pyrazolidine, 1,2-dimethyl-
- Formula: C5H12N2
- Molecular weight: 100.1622
- IUPAC Standard InChIKey: DKXPLHOKMGMMQM-UHFFFAOYSA-N
- CAS Registry Number: 38704-89-1
- Chemical structure:
View 3d structure (requires JavaScript / HTML 5) - Permanent link for this species. Use this link for bookmarking this species for future reference.

Gas phase ion energetics data

Data evaluated as indicated in comments:
HL - Edward P. Hunter and Sharon G. Lias
Data compiled as indicated in comments:
LBLHLM - Sharon G. Lias, John E. Bartmess, Joel F. Liebman, John L. Holmes, Rhoda D. Levin, and W. Gary Mallard
LLK - Sharon G. Lias, Rhoda D. Levin, and Sherif A. Kafafi
Quantity | Value | Units | Method | Reference | Comment |
---|---|---|---|---|---|
Proton affinity (review) | 959.3 | kJ/mol | N/A | Hunter and Lias, 1998 | HL |
Quantity | Value | Units | Method | Reference | Comment |
Gas basicity | 928.6 | kJ/mol | N/A | Hunter and Lias, 1998 | HL |
Ionization energy determinations
IE (eV) | Method | Reference | Comment |
---|---|---|---|
6.66 ± 0.05 | EQ | Rumack, 1986 | LBLHLM |
8.93 | PE | Nelsen, 1984 | Vertical value; LBLHLM |
7.78 | PE | Nelsen, Peacock, et al., 1976 | Vertical value; LLK |
9.05 | PE | Rademacher, 1974 | Vertical value; LLK |
7.90 | PE | Rademacher, 1974 | Vertical value; LLK |
7.78 | PE | Nelsen and Buschek, 1974 | Vertical value; LLK |
8.33 | PE | Nelsen and Buschek, 1974 | Vertical value; LLK |
7.777 | PE | Nelsen and Buschek, 1974, 2 | Vertical value; LLK |
8.325 | PE | Nelsen and Buschek, 1974, 2 | Vertical value; LLK |

References

Hunter and Lias, 1998
Hunter, E.P.; Lias, S.G.,
Evaluated Gas Phase Basicities and Proton Affinities of Molecules: An Update,
J. Phys. Chem. Ref. Data, 1998, 27, 3, 413-656, https://doi.org/10.1063/1.556018
. [all data]
Rumack, 1986
Rumack, D.,
Title unavailable,
Personal communication to S.G. Lias, 1986. [all data]
Nelsen, 1984
Nelsen, S.F.,
Ionization from nitrogen and oxygen lone pairs: A comparison of trialkylamine, dialkyl ether, tetraalkylhydrazine, and dialkyl peroxide photoelectron spectroscopic ionization potentials,
J. Org. Chem., 1984, 49, 1891. [all data]
Nelsen, Peacock, et al., 1976
Nelsen, S.F.; Peacock, V.; Weisman, G.R.,
Single-electron oxidation equilibria of tetraalkylhydrazines. Comparison of solution E° values and vapor-phase ionization potentials,
J. Am. Chem. Soc., 1976, 98, 5269. [all data]
Rademacher, 1974
Rademacher, P.,
Photoelectron spectra and conformation of cyclic N,N'-dimethylhydrazines,
Tetrahedron Lett., 1974, 83. [all data]
Nelsen and Buschek, 1974
Nelsen, S.F.; Buschek, J.M.,
Photoelectron spectra of hydrazines. V. Pyrazolidine and hexahydropyridazine derivatives,
J. Am. Chem. Soc., 1974, 96, 6987. [all data]
Nelsen and Buschek, 1974, 2
Nelsen, S.F.; Buschek, J.M.,
Photoelectron spectra of hydrazines. IV. Empirical estimation of lone pair-lone pair dihedral angles and prediction of lone pair ionization potentials for some cyclic and bicyclic hydrazines,
J. Am. Chem. Soc., 1974, 96, 6982. [all data]