Gallium di-μ-fluorotetrafluorodi-
- Formula: F6Ga2
- Molecular weight: 253.436
- CAS Registry Number: 38586-87-7

Gas phase ion energetics data

Data compiled by: Sharon G. Lias, Rhoda D. Levin, and Sherif A. Kafafi
Appearance energy determinations
Ion | AE (eV) | Other Products | Method | Reference | Comment |
---|---|---|---|---|---|
F5Ga2+ | 15.6 ± 0.5 | ? | EI | Feather, Buchler, et al., 1972 |

References

Feather, Buchler, et al., 1972
Feather, D.H.; Buchler, A.; Searcy, A.W.,
The vapor pressures of gallium trifluoride monomer and dimer,
High Temp. Sci., 1972, 4, 290. [all data]