Isopropyldifluoroborane
- Formula: C3H7BF2
- Molecular weight: 91.895
- IUPAC Standard InChIKey: ZNGYGWBCHYGGRA-UHFFFAOYSA-N
- CAS Registry Number: 3857-03-2
- Chemical structure:
View 3d structure (requires JavaScript / HTML 5) - Permanent link for this species. Use this link for bookmarking this species for future reference.

Gas phase ion energetics data

Data compiled by: Henry M. Rosenstock, Keith Draxl, Bruce W. Steiner, and John T. Herron
Appearance energy determinations
Ion | AE (eV) | Other Products | Method | Reference | Comment |
---|---|---|---|---|---|
BF2+ | 14.6 ± 0.2 | C3H7 | EI | Steele, Nichols, et al., 1962 | |
C2H3+ | 14.8 ± 0.1 | ? | EI | Steele, Nichols, et al., 1962 | |
C2H3BF+ | 11.8 ± 0.1 | ? | EI | Steele, Nichols, et al., 1962 | |
C2H3BF2+ | 12.80 ± 0.05 | CH4 | EI | Steele, Nichols, et al., 1962 | |
C2H4BF2+ | 12.58 ± 0.05 | CH3 | EI | Steele, Nichols, et al., 1962 | |
C3H6+ | 11.48 ± 0.02 | ? | EI | Steele, Nichols, et al., 1962 | |
C3H7+ | 12.05 ± 0.05 | ? | EI | Steele, Nichols, et al., 1962 |

References

Steele, Nichols, et al., 1962
Steele, W.C.; Nichols, L.D.; Stone, F.G.A.,
An electron impact investigation of some organoboron difluorides,
J. Am. Chem. Soc., 1962, 84, 1154. [all data]