Tetrabenzo[b,g,k,p]chrysene
- Formula: C34H20
- Molecular weight: 428.5226
- IUPAC Standard InChIKey: FFVDHSRRIIFRLJ-UHFFFAOYSA-N
- CAS Registry Number: 385-15-9
- Chemical structure:
View 3d structure (requires JavaScript / HTML 5) - Permanent link for this species. Use this link for bookmarking this species for future reference.

Gas phase ion energetics data

Data compiled as indicated in comments:
LLK - Sharon G. Lias, Rhoda D. Levin, and Sherif A. Kafafi
Ionization energy determinations
IE (eV) | Method | Reference | Comment |
---|---|---|---|
6.83 ± 0.02 | PE | Schmidt, 1977 | LLK |

References

Schmidt, 1977
Schmidt, W.,
Photoelectron spectra of polynuclear aromatics. V. Correlations with ultraviolet absorption spectra in the catacondensed series,
J. Chem. Phys., 1977, 66, 828. [all data]