Tetrabenzo[de,hi,mn,qr]naphthacene
- Formula: C30H16
- Molecular weight: 376.4480
- IUPAC Standard InChIKey: GXLNAHLOKJQKHW-UHFFFAOYSA-N
- CAS Registry Number: 385-13-7
- Chemical structure:
View 3d structure (requires JavaScript / HTML 5) - Permanent link for this species. Use this link for bookmarking this species for future reference.

Gas phase ion energetics data

Data compiled as indicated in comments:
LLK - Sharon G. Lias, Rhoda D. Levin, and Sherif A. Kafafi
Ionization energy determinations
IE (eV) | Method | Reference | Comment |
---|---|---|---|
6.90 | PE | Clar and Schmidt, 1979 | LLK |
6.90 ± 0.04 | PE | Boschi, Clar, et al., 1974 | LLK |

References

Clar and Schmidt, 1979
Clar, E.; Schmidt, W.,
Correlations between photoelectron and UV absorption spectra of polycyclic hydrocarbons. The pyrene series,
Tetrahedron, 1979, 35, 1027. [all data]
Boschi, Clar, et al., 1974
Boschi, R.; Clar, E.; Schmidt, W.,
Photoelectron spectra of polynuclear aromatics. III. The effect of nonplanarity in sterically overcrowded aromatic hydrocarbons,
J. Chem. Phys., 1974, 60, 4406. [all data]