Benzaldehyde,2,5-dimethyl-4-(methyl-d)-

Gas phase ion energetics data

Data compiled by: Sharon G. Lias, Rhoda D. Levin, and Sherif A. Kafafi

Ionization energy determinations

IE (eV) Method Reference
8.7 ± 0.1EISchwarz, Bohlmann, et al., 1973

Appearance energy determinations

Ion AE (eV) Other Products MethodReferenceComment
C9H8DO+11.4 ± 0.1CH3EISchwarz, Bohlmann, et al., 1973
C9H9O+11.4 ± 0.1CH2DEISchwarz, Bohlmann, et al., 1973

References

Schwarz, Bohlmann, et al., 1973
Schwarz, H.; Bohlmann, F.; Russ, B., Elektronenstossinduzierte fagmentieru von polymethylbenzaldehyden. II. Mechanismus der methyl-abspaltung aus dem molekul-ion von tri- und pentamethylbenzaldehyden, Org. Mass Spectrom., 1973, 7, 1001. [all data]