Ethanedione,(4-hydroxyphenyl)phenyl-
- Formula: C14H10O3
- Molecular weight: 226.2274
- IUPAC Standard InChIKey: IVUXDMQTCNWTDP-UHFFFAOYSA-N
- CAS Registry Number: 38469-73-7
- Chemical structure:
View 3d structure (requires JavaScript / HTML 5) - Other names: 1-(4-Hydroxyphenyl)-2-phenylethan-1,2-dion; 1-(4-Hydroxyphenyl)-2-phenylethane-1,2-dione

Gas phase ion energetics data

Data compiled by: Sharon G. Lias, Rhoda D. Levin, and Sherif A. Kafafi
Ionization energy determinations
IE (eV) | Method | Reference | Comment |
---|---|---|---|
8.9 ± 0.05 | PE | McAlduff and Bunbury, 1979 | Vertical value |

References

McAlduff and Bunbury, 1979
McAlduff, E.J.; Bunbury, D.L.,
Photoelectron spectra of some aromatic mono-and di-ketones,
J. Electron Spectrosc. Relat. Phenom., 1979, 17, 81. [all data]