trans-1-Phenyl-3,3-dimethyl-but-1-ene
- Formula: C12H16
- Molecular weight: 160.2554
- IUPAC Standard InChIKey: DXIJHCSGLOHNES-MDZDMXLPSA-N
- CAS Registry Number: 3846-66-0
- Chemical structure:
View 3d structure (requires JavaScript / HTML 5) - Stereoisomers:

Condensed phase thermochemistry data

Data compiled by: Hussein Y. Afeefy, Joel F. Liebman, and Stephen E. Stein
Quantity | Value | Units | Method | Reference | Comment |
---|---|---|---|---|---|
ΔfH°liquid | -22.6 ± 4.1 | kJ/mol | Ccb | Yates and McDonald, 1973 | |
Quantity | Value | Units | Method | Reference | Comment |
ΔcH°liquid | -6986.2 ± 4.1 | kJ/mol | Ccb | Yates and McDonald, 1973 | Corresponding ΔfHºliquid = -22.6 kJ/mol (simple calculation by NIST; no Washburn corrections) |

Gas phase ion energetics data

Data compiled as indicated in comments:
LLK - Sharon G. Lias, Rhoda D. Levin, and Sherif A. Kafafi
Ionization energy determinations
IE (eV) | Method | Reference | Comment |
---|---|---|---|
7.9 | PE | Kobayashi, Arai, et al., 1981 | LLK |
7.80 ± 0.04 | EI | Benito, Seidl, et al., 1973 | LLK |
8.18 | PE | Kobayashi, Arai, et al., 1981 | Vertical value; LLK |

References

Yates and McDonald, 1973
Yates, K.; McDonald, R.S.,
Kinetics and mechanisms of electrophilic addition. II. A thermochemical-kinetic approach to transition-state structure,
J. Org. Chem., 1973, 38, 2465-2478. [all data]
Kobayashi, Arai, et al., 1981
Kobayashi, T.; Arai, T.; Sakuragi, H.; Tokumaru, K.; Utsunomiya, C.,
A new nethod for conformational analysis by photoelectron spectroscopy with application to alkyl-substituted styrenes,
Bull. Chem. Soc. Jpn., 1981, 54, 1658. [all data]
Benito, Seidl, et al., 1973
Benito, I.; Seidl, H.; Bock, H.,
Efectos electronicos y estericos de sustituyentes alquilicos y silicicos sobre el sistema electronico π del estireno,
Rev. Fac. Cienc. Univ. Oviedo, 1973, 14, 95. [all data]