Trisilane,1,1,1,2,2,3,3-heptamethyl-3-(1-naphthalenyl)-
- Formula: C17H28Si3
- Molecular weight: 316.6607
- IUPAC Standard InChIKey: QMUHOVBKQKHWOD-UHFFFAOYSA-N
- CAS Registry Number: 38446-42-3
- Chemical structure:
View 3d structure (requires JavaScript / HTML 5) - Permanent link for this species. Use this link for bookmarking this species for future reference.

Gas phase ion energetics data

Data compiled by: Sharon G. Lias, Rhoda D. Levin, and Sherif A. Kafafi
Ionization energy determinations
IE (eV) | Method | Reference |
---|---|---|
7.93 | CTS | Pitt, Carey, et al., 1972 |

References

Pitt, Carey, et al., 1972
Pitt, C.G.; Carey, R.N.; Toren, E.C.,
Nature of the electronic interactions in aryl-substituted polysilanes,
J. Am. Chem. Soc., 1972, 94, 3806. [all data]