Disilane,1,1,2,2-tetramethyl-1,2-di-1-naphthalenyl-
- Formula: C24H26Si2
- Molecular weight: 370.6342
- IUPAC Standard InChIKey: RLWPPMCLXCJLGQ-UHFFFAOYSA-N
- CAS Registry Number: 38446-41-2
- Chemical structure:
View 3d structure (requires JavaScript / HTML 5) - Permanent link for this species. Use this link for bookmarking this species for future reference.

Gas phase ion energetics data

Data compiled by: Sharon G. Lias, Rhoda D. Levin, and Sherif A. Kafafi
Ionization energy determinations
IE (eV) | Method | Reference |
---|---|---|
7.91 | CTS | Pitt, Carey, et al., 1972 |

References

Pitt, Carey, et al., 1972
Pitt, C.G.; Carey, R.N.; Toren, E.C.,
Nature of the electronic interactions in aryl-substituted polysilanes,
J. Am. Chem. Soc., 1972, 94, 3806. [all data]