Disilane,pentamethyl-1-naphthalenyl-
- Formula: C15H22Si2
- Molecular weight: 258.5062
- IUPAC Standard InChIKey: HOCAJYZQOFSYAZ-UHFFFAOYSA-N
- CAS Registry Number: 38446-40-1
- Chemical structure:
View 3d structure (requires JavaScript / HTML 5) - Permanent link for this species. Use this link for bookmarking this species for future reference.

Gas phase ion energetics data

Data compiled by: Sharon G. Lias, Rhoda D. Levin, and Sherif A. Kafafi
Ionization energy determinations
IE (eV) | Method | Reference |
---|---|---|
7.95 | CTS | Pitt, Carey, et al., 1972 |

References

Pitt, Carey, et al., 1972
Pitt, C.G.; Carey, R.N.; Toren, E.C.,
Nature of the electronic interactions in aryl-substituted polysilanes,
J. Am. Chem. Soc., 1972, 94, 3806. [all data]
Todesco and Basheer, 1986
Todesco, R.V.; Basheer, R.,
J. Polimer Sci., Chem. Ed., 1986, 24, 1943. [all data]