5-Chloro-2-methoxypyrimidine
- Formula: C5H5ClN2O
- Molecular weight: 144.559
- IUPAC Standard InChIKey: GJNGJHZIOYFEOP-UHFFFAOYSA-N
- CAS Registry Number: 38373-44-3
- Chemical structure:
View 3d structure (requires JavaScript / HTML 5) - Other names: Pyrimidine,5-chloro-2-methoxy-

Gas phase ion energetics data

Data compiled by: Sharon G. Lias, Rhoda D. Levin, and Sherif A. Kafafi
Ionization energy determinations
IE (eV) | Method | Reference |
---|---|---|
9.36 ± 0.05 | EI | Gacek, Thorstad, et al., 1978 |

References

Gacek, Thorstad, et al., 1978
Gacek, M.; Thorstad, O.; Ongstad, L.; Undheim, K.,
Ionisation potentials in tautomer analysis of 2-hydroxypyrimidines,
Chem. Scr., 1978, 13, 99. [all data]