Acetic acid, trifluoro-, ethyl ester
- Formula: C4H5F3O2
- Molecular weight: 142.0765
- IUPAC Standard InChIKey: STSCVKRWJPWALQ-UHFFFAOYSA-N
- CAS Registry Number: 383-63-1
- Chemical structure:
View 3d structure (requires JavaScript / HTML 5) - Other names: Ethyl trifluoroacetate; Trifluoroacetic acid, ethyl ester; CF3COOC2H5; Ethyl trifluoroethanoate; Ethyl ester of Trifluoroacetic acid

Phase change data

Data compiled as indicated in comments:
BS - Robert L. Brown and Stephen E. Stein
AC - William E. Acree, Jr., James S. Chickos
Quantity | Value | Units | Method | Reference | Comment |
---|---|---|---|---|---|
Tboil | 333. to 335. | K | N/A | Farchan Laboratories, 1990 | BS |
Tboil | 334.2 | K | N/A | Weast and Grasselli, 1989 | BS |
Enthalpy of vaporization
ΔvapH (kJ/mol) | Temperature (K) | Method | Reference | Comment |
---|---|---|---|---|
34.7 | 335. | HG | Majid and Shreeve, 1973 | AC |

Reaction thermochemistry data

Data compiled by: Michael M. Meot-Ner (Mautner) and Sharon G. Lias
Individual Reactions
By formula: CH6N+ + C4H5F3O2 = (CH6N+ • C4H5F3O2)
Bond type: Hydrogen bonds of the type NH+-O between organics
Quantity | Value | Units | Method | Reference | Comment |
---|---|---|---|---|---|
ΔrH° | 89.5 | kJ/mol | PHPMS | Meot-Ner, 1984 | gas phase; Entropy change calculated or estimated |
Quantity | Value | Units | Method | Reference | Comment |
ΔrS° | 110. | J/mol*K | N/A | Meot-Ner, 1984 | gas phase; Entropy change calculated or estimated |
Free energy of reaction
ΔrG° (kJ/mol) | T (K) | Method | Reference | Comment |
---|---|---|---|---|
39. | 450. | PHPMS | Meot-Ner, 1984 | gas phase; Entropy change calculated or estimated |

Gas phase ion energetics data

Data evaluated as indicated in comments:
HL - Edward P. Hunter and Sharon G. Lias
Data compiled as indicated in comments:
LLK - Sharon G. Lias, Rhoda D. Levin, and Sherif A. Kafafi
Quantity | Value | Units | Method | Reference | Comment |
---|---|---|---|---|---|
Proton affinity (review) | 758.8 | kJ/mol | N/A | Hunter and Lias, 1998 | HL |
Quantity | Value | Units | Method | Reference | Comment |
Gas basicity | 727.9 | kJ/mol | N/A | Hunter and Lias, 1998 | HL |
Ionization energy determinations
IE (eV) | Method | Reference | Comment |
---|---|---|---|
11.0 | PE | Sweigart and Turner, 1972 | LLK |
~11.6 | PE | Sweigart and Turner, 1972 | Vertical value; LLK |

Ion clustering data

Data compiled by: Michael M. Meot-Ner (Mautner) and Sharon G. Lias
Clustering reactions
By formula: CH6N+ + C4H5F3O2 = (CH6N+ • C4H5F3O2)
Bond type: Hydrogen bonds of the type NH+-O between organics
Quantity | Value | Units | Method | Reference | Comment |
---|---|---|---|---|---|
ΔrH° | 89.5 | kJ/mol | PHPMS | Meot-Ner, 1984 | gas phase; Entropy change calculated or estimated |
Quantity | Value | Units | Method | Reference | Comment |
ΔrS° | 110. | J/mol*K | N/A | Meot-Ner, 1984 | gas phase; Entropy change calculated or estimated |
Free energy of reaction
ΔrG° (kJ/mol) | T (K) | Method | Reference | Comment |
---|---|---|---|---|
39. | 450. | PHPMS | Meot-Ner, 1984 | gas phase; Entropy change calculated or estimated |

Kovats' RI, non-polar column, isothermal

Column type | Active phase | Temperature (C) | I | Reference | Comment |
---|---|---|---|---|---|
Capillary | OV-101 | 100. | 474. | Promyshlennikova, Kirichenko, et al., 1992 | |
Capillary | OV-101 | 100. | 473.8 | Promyshlennikova, Kirichenko, et al., 1991 | He; Column length: 50. m; Column diameter: 0.25 mm |

References

Farchan Laboratories, 1990
Farchan Laboratories,
Research Chemicals Catalog, Farchan Laboratories, Gainesville, FL, 1990, 91. [all data]
Weast and Grasselli, 1989
CRC Handbook of Data on Organic Compounds, 2nd Editon, Weast,R.C and Grasselli, J.G., ed(s)., CRC Press, Inc., Boca Raton, FL, 1989, 1. [all data]
Majid and Shreeve, 1973
Majid, A.; Shreeve, Jean'ne M.,
Fluorinated esters stable to fluoride ion,
J. Org. Chem., 1973, 38, 23, 4028-4031, https://doi.org/10.1021/jo00987a016
. [all data]
Meot-Ner, 1984
Meot-Ner, (Mautner)M.,
The Ionic Hydrogen Bond and Ion Solvation. 1. -NH+ O-, -NH+ N- and -OH+ O- Bonds. Correlations with Proton Affinity. Deviations Due to Structural Effects,
J. Am. Chem. Soc., 1984, 106, 5, 1257, https://doi.org/10.1021/ja00317a015
. [all data]
Hunter and Lias, 1998
Hunter, E.P.; Lias, S.G.,
Evaluated Gas Phase Basicities and Proton Affinities of Molecules: An Update,
J. Phys. Chem. Ref. Data, 1998, 27, 3, 413-656, https://doi.org/10.1063/1.556018
. [all data]
Sweigart and Turner, 1972
Sweigart, D.A.; Turner, D.W.,
Lone pair orbitals and their interactions studied by photoelectron spectroscopy. I. Carboxylic acids and their derivatives,
J. Am. Chem. Soc., 1972, 94, 5592. [all data]
Promyshlennikova, Kirichenko, et al., 1992
Promyshlennikova, E.P.; Kirichenko, V.E.; Pashkevich, K.I.; Grigor'eva, D.N.; Golovnya, R.V.,
Influence of the stationary phase nature on the retention of polyfluorinated carboxylic acid esters,
Zh. Anal. Khim., 1992, 47, 1070-1075. [all data]
Promyshlennikova, Kirichenko, et al., 1991
Promyshlennikova, E.P.; Kirichenko, V.E.; Pashkevich, K.I.; Grigor'eva, D.N.; Golovnya, R.V.,
Capillary chromatography of polyfluorinated carboxylic esters,
Izv. Akad. Nauk SSSR Ser. Khim., 1991, 8, 1541-1545. [all data]