2(1H)-Pyrimidinone, 5-bromo-
- Formula: C4H3BrN2O
- Molecular weight: 174.983
- IUPAC Standard InChIKey: VTUDATOSQGYWML-UHFFFAOYSA-N
- CAS Registry Number: 38353-06-9
- Chemical structure:
View 3d structure (requires JavaScript / HTML 5) - Other names: 5-Bromo-2(1H)-pyrimidinone; 5-Bromo-2-hydroxypyrimidine; 5-Bromo-2-pyrimidinol; 5-bromo-1H-pyrimidin-2-one

Gas phase ion energetics data

Data compiled by: Sharon G. Lias, Rhoda D. Levin, and Sherif A. Kafafi
Ionization energy determinations
IE (eV) | Method | Reference |
---|---|---|
9.47 ± 0.05 | EI | Gacek, Thorstad, et al., 1978 |

References

Gacek, Thorstad, et al., 1978
Gacek, M.; Thorstad, O.; Ongstad, L.; Undheim, K.,
Ionisation potentials in tautomer analysis of 2-hydroxypyrimidines,
Chem. Scr., 1978, 13, 99. [all data]