1,2,4-Trithiolane, 3,3,5,5-tetramethyl-
- Formula: C6H12S3
- Molecular weight: 180.354
- IUPAC Standard InChIKey: XFOWPRWOLKTTSD-UHFFFAOYSA-N
- CAS Registry Number: 38348-31-1
- Chemical structure:
View 3d structure (requires JavaScript / HTML 5) - Other names: 3,3,5,5-Tetramethyl-1,2,4-trithiolane; 1,2,4-Trithiolane, tetramethyl-

Gas phase ion energetics data

Data compiled as indicated in comments:
LLK - Sharon G. Lias, Rhoda D. Levin, and Sherif A. Kafafi
Ionization energy determinations
IE (eV) | Method | Reference | Comment |
---|---|---|---|
8.1 ± 0.2 | PE | Guimon, Guimon, et al., 1976 | Vertical value; LLK |
8.12 | PE | Guimon, Guimon, et al., 1975 | Vertical value; LLK |

Normal alkane RI, non-polar column, temperature ramp

Column type | Active phase | I | Reference | Comment |
---|---|---|---|---|
Capillary | HP-5 | 1233. | Kubec, Velísek, et al., 1997 | 30. m/0.25 mm/0.25 μm, N2, 40. C @ 3. min, 4. K/min, 240. C @ 10. min |

Normal alkane RI, polar column, temperature ramp

Column type | Active phase | I | Reference | Comment |
---|---|---|---|---|
Capillary | HP-Innowax | 1651. | Kubec, Velísek, et al., 1997 | 30. m/0.25 mm/0.5 μm, N2, 40. C @ 3. min, 4. K/min; Tend: 190. C |

References

Guimon, Guimon, et al., 1976
Guimon, M.F.; Guimon, C.; Metras, F.; Pfister-Guillouzo, G.,
Analyse conformationnelle de trithiolannes-1,2,4,
Can. J. Chem., 1976, 54, 146. [all data]
Guimon, Guimon, et al., 1975
Guimon, M.-F.; Guimon, C.; Pfister-Guillouzo, G.,
Application of photoelectron spectroscopy to conformational analysis of 1,2,4-trithiolanes,
Tetrahedron Lett., 1975, 7, 441. [all data]
Kubec, Velísek, et al., 1997
Kubec, R.; Velísek, J.; Dolezal, M.; Kubelka, V.,
Sulfur-containing volatiles arising by thermal degradation of alliin and deoxyalliin,
J. Agric. Food Chem., 1997, 45, 9, 3580-3585, https://doi.org/10.1021/jf970071q
. [all data]