Silane, (fluoroethynyl)trimethyl-
- Formula: C5H9FSi
- Molecular weight: 116.2089
- IUPAC Standard InChIKey: TXLXSKCYPYZPOY-UHFFFAOYSA-N
- CAS Registry Number: 38346-22-4
- Chemical structure:
View 3d structure (requires JavaScript / HTML 5) - Permanent link for this species. Use this link for bookmarking this species for future reference.

Gas phase ion energetics data

Data compiled by: Sharon G. Lias, Rhoda D. Levin, and Sherif A. Kafafi
Ionization energy determinations
IE (eV) | Method | Reference |
---|---|---|
9.8 ± 0.1 | PE | Bieri, Brogli, et al., 1973 |

References

Bieri, Brogli, et al., 1973
Bieri, G.; Brogli, F.; Heilbronner, E.; Kloster-Jensen, E.,
A photoelectron spectroscopic investigation of the electronic structure of trimethylsilylhaloacetylenes,
J. Electron Spectrosc. Relat. Phenom., 1973, 1, 67. [all data]