Methylenecyclodecane
- Formula: C11H20
- Molecular weight: 152.2765
- IUPAC Standard InChIKey: DHNLLZWVLDZCFD-UHFFFAOYSA-N
- CAS Registry Number: 3817-57-0
- Chemical structure:
View 3d structure (requires JavaScript / HTML 5) - Permanent link for this species. Use this link for bookmarking this species for future reference.

Gas phase ion energetics data

Data compiled by: Sharon G. Lias, John E. Bartmess, Joel F. Liebman, John L. Holmes, Rhoda D. Levin, and W. Gary Mallard
Ionization energy determinations
IE (eV) | Method | Reference | Comment |
---|---|---|---|
8.91 | PE | Spanka and Rademacher, 1986 | Vertical value |

References

Spanka and Rademacher, 1986
Spanka, G.; Rademacher, P.,
Transannular interactions in difunctional medium rings. 1. n/π Interactions in cyclic amino ketones and aminoalkenes studied by photoelectron spectroscopy,
J. Org. Chem., 1986, 51, 592. [all data]