1,3-Cyclooctadiene, (Z,Z)-
- Formula: C8H12
- Molecular weight: 108.1809
- IUPAC Standard InChIKey: RRKODOZNUZCUBN-CCAGOZQPSA-N
- CAS Registry Number: 3806-59-5
- Chemical structure:
View 3d structure (requires JavaScript / HTML 5) - Species with the same structure:
- Stereoisomers:
- Other names: cis,cis-1,3-Cyclooctadiene; c,c-Cycloocta-1,3-diene; 1,3-Cyclooctadiene

Gas phase thermochemistry data

Data compiled by: Hussein Y. Afeefy, Joel F. Liebman, and Stephen E. Stein
Quantity | Value | Units | Method | Reference | Comment |
---|---|---|---|---|---|
ΔfH°gas | 84.1 | kJ/mol | Chyd | Roth, Adamczak, et al., 1991 |

Phase change data

Data compiled by: Robert L. Brown and Stephen E. Stein
Reduced pressure boiling point
Tboil (K) | Pressure (bar) | Reference |
---|---|---|
328.2 | 0.045 | Aldrich Chemical Company Inc., 1990 |
328. | 0.045 | Farchan Laboratories, 1990 |

Reaction thermochemistry data

Data compiled by: Hussein Y. Afeefy, Joel F. Liebman, and Stephen E. Stein
Individual Reactions
By formula: 2H2 + C8H12 = C8H16
Quantity | Value | Units | Method | Reference | Comment |
---|---|---|---|---|---|
ΔrH° | -208. | kJ/mol | Chyd | Roth, Adamczak, et al., 1991 | liquid phase |
ΔrH° | -204.8 ± 0.3 | kJ/mol | Chyd | Turner, Mallon, et al., 1973 | liquid phase; solvent: Glacial acetic acid |
By formula: C8H12 = C8H12
Quantity | Value | Units | Method | Reference | Comment |
---|---|---|---|---|---|
ΔrH° | -16.4 ± 1.4 | kJ/mol | Eqk | Taskinen and Nummelin, 1985 | liquid phase |
By formula: C8H12 = C8H12
Quantity | Value | Units | Method | Reference | Comment |
---|---|---|---|---|---|
ΔrH° | -19.4 ± 0.9 | kJ/mol | Eqk | Taskinen and Nummelin, 1985 | liquid phase |

Gas phase ion energetics data

Data compiled by: Henry M. Rosenstock, Keith Draxl, Bruce W. Steiner, and John T. Herron
Ionization energy determinations
IE (eV) | Method | Reference | Comment |
---|---|---|---|
8.68 | PE | Bischof and Heilbronner, 1970 | Vertical value |

Kovats' RI, non-polar column, isothermal

Column type | Active phase | Temperature (C) | I | Reference | Comment |
---|---|---|---|---|---|
Capillary | OV-1 | 100. | 904.6 | Engewald, Billing, et al., 1987 | Column length: 50. m; Column diameter: 0.3 mm |
Packed | Squalane | 70. | 889. | Bogoslovsky, Anvaer, et al., 1978 | |
Capillary | Squalane | 42.5 | 874. | Engewald, Epsch, et al., 1974 | N2; Column length: 100. m; Column diameter: 0.23 mm |
Capillary | Squalane | 80. | 889. | Engewald, Epsch, et al., 1974 | N2; Column length: 100. m; Column diameter: 0.23 mm |
Packed | Squalane | 100. | 893. | Robinson and Odell, 1971 | N2, Embacel; Column length: 3.0 m |
Capillary | Squalane | 70. | 889. | Schomburg, 1966 |

Van Den Dool and Kratz RI, non-polar column, temperature ramp

Column type | Active phase | I | Reference | Comment |
---|---|---|---|---|
Capillary | Petrocol DH | 886. | White, Hackett, et al., 1992 | 100. m/0.25 mm/0.5 μm, He, 1. K/min; Tstart: 30. C; Tend: 220. C |

Normal alkane RI, non-polar column, custom temperature program

Column type | Active phase | I | Reference | Comment |
---|---|---|---|---|
Packed | SE-30 | 920. | Robinson and Odell, 1971 | N2, Chromosorb W; Column length: 6.1 m; Program: 50C910min) => 20C/min => 90(6min) => 10C/min => 150C(hold) |
Packed | Squalane | 892. | Robinson and Odell, 1971 | N2, Embacel; Column length: 3.0 m; Program: 25C(5min) => 2C/min => 35 => 4C/min => 95C(hold) |
Packed | SE-30 | 920. | Robinson and Odell, 1971, 2 | Chrom W; Column length: 6.1 m; Program: 50C(10min) => 20C/min(2min) => 90C(6min) => 10C/min(6min) => (hold at 150C) |
Packed | Squalane | 892. | Robinson and Odell, 1971, 2 | Embacel; Column length: 3.0 m; Program: 25C(5min) => 2C/min(5min) => 4C/min(15min) => (hold at 95C) |

References

Roth, Adamczak, et al., 1991
Roth, W.R.; Adamczak, O.; Breuckmann, R.; Lennartz, H.-W.; Boese, R.,
Die Berechnung von Resonanzenergien; das MM2ERW-Kraftfeld,
Chem. Ber., 1991, 124, 2499-2521. [all data]
Aldrich Chemical Company Inc., 1990
Aldrich Chemical Company Inc.,
Catalog Handbook of Fine Chemicals, Aldrich Chemical Company, Inc., Milwaukee WI, 1990, 1. [all data]
Farchan Laboratories, 1990
Farchan Laboratories,
Research Chemicals Catalog, Farchan Laboratories, Gainesville, FL, 1990, 91. [all data]
Turner, Mallon, et al., 1973
Turner, R.B.; Mallon, B.J.; Tichy, M.; Doering, W.v.E.; Roth, W.R.; Schroder, G.,
Heats of hydrogenation. X. Conjugative interaction in cyclic dienes and trienes,
J. Am. Chem. Soc., 1973, 95, 8605-8610. [all data]
Taskinen and Nummelin, 1985
Taskinen, E.; Nummelin, K.,
Relative thermodynamic stabilities of the isomeric cyclooctadienes,
Acta Chem. Scand., Ser. B, 1985, 39, 791-792. [all data]
Bischof and Heilbronner, 1970
Bischof, P.; Heilbronner, E.,
Photoelektron-Spektren von Cycloalkenen und Cycloalkadienen,
Helv. Chim. Acta, 1970, 53, 1677. [all data]
Engewald, Billing, et al., 1987
Engewald, W.; Billing, U.; Welsch, T.; Haufe, G.,
Structure-retention correlations of hydrocarbons in gas-liquid and gas-solid chromatography. Cycloalkenes and cycloalkadienes,
Chromatographia, 1987, 23, 8, 590-594, https://doi.org/10.1007/BF02324870
. [all data]
Bogoslovsky, Anvaer, et al., 1978
Bogoslovsky, Yu.N.; Anvaer, B.I.; Vigdergauz, M.S.,
Chromatographic constants in gas chromatography (in Russian), Standards Publ. House, Moscow, 1978, 192. [all data]
Engewald, Epsch, et al., 1974
Engewald, W.; Epsch, K.; Graefe, J.; Welsch, Th.,
Molekülstruktur und retentionsverhalten. II. Retentionsverhalten cycloaliphatischer kohlenwasser-stoffe bei der gas-adsorptions- und gas-verteilungschromatographie,
J. Chromatogr., 1974, 91, 623-631, https://doi.org/10.1016/S0021-9673(01)97943-9
. [all data]
Robinson and Odell, 1971
Robinson, P.G.; Odell, A.L.,
A system of standard retention indices and its uses. The characterisation of stationary phases and the prediction of retention indices,
J. Chromatogr., 1971, 57, 1-10, https://doi.org/10.1016/0021-9673(71)80001-8
. [all data]
Schomburg, 1966
Schomburg, G.,
Gaschromatographische Retentionsdaten und struktur chemischer verbindungen. III. Alkylverzweigte und ungesättigte cyclische Kohlenwasserstoffe,
J. Chromatogr., 1966, 23, 18-41, https://doi.org/10.1016/S0021-9673(01)98653-4
. [all data]
White, Hackett, et al., 1992
White, C.M.; Hackett, J.; Anderson, R.R.; Kail, S.; Spock, P.S.,
Linear temperature programmed retention indices of gasoline range hydrocarbons and chlorinated hydrocarbons on cross-linked polydimethylsiloxane,
J. Hi. Res. Chromatogr., 1992, 15, 2, 105-120, https://doi.org/10.1002/jhrc.1240150211
. [all data]
Robinson and Odell, 1971, 2
Robinson, P.G.; Odell, A.L.,
Comparison of isothermal and non-linear temperature programmed gas chromatography. The temperature dependence of the retention indices of a number of hydrocarbons on squalane and SE-30,
J. Chromatogr., 1971, 57, 11-17, https://doi.org/10.1016/0021-9673(71)80002-X
. [all data]