Zirconium, tetrakis(2,2-dimethylpropyl)-
- Formula: C20H44Zr
- Molecular weight: 375.787
- CAS Registry Number: 38010-72-9

Gas phase thermochemistry data

Data compiled by: José A. Martinho Simões
Quantity | Value | Units | Method | Reference | Comment |
---|---|---|---|---|---|
ΔfH°gas | -258. ± 24. | kJ/mol | Review | Martinho Simões | The enthalpy of formation relies on -1796. ± 15. kJ/mol for the enthalpy of formation of Zr(O-i-Pr)4(cr) |

Condensed phase thermochemistry data

Data compiled by: José A. Martinho Simões
Quantity | Value | Units | Method | Reference | Comment |
---|---|---|---|---|---|
ΔfH°solid | -345. ± 22. | kJ/mol | Review | Martinho Simões | The enthalpy of formation relies on -1796. ± 15. kJ/mol for the enthalpy of formation of Zr(O-i-Pr)4(cr) |

Phase change data

Data compiled by: José A. Martinho Simões
Quantity | Value | Units | Method | Reference | Comment |
---|---|---|---|---|---|
ΔsubH° | 87.9 ± 8.4 | kJ/mol | RSC | Lappert, Patil, et al., 1975 |

Gas phase ion energetics data

Data compiled by: Sharon G. Lias, Rhoda D. Levin, and Sherif A. Kafafi
Ionization energy determinations
IE (eV) | Method | Reference | Comment |
---|---|---|---|
8.3 ± 0.1 | PE | Lappert, Pedley, et al., 1974 | Vertical value |

References

Martinho Simões
Martinho Simões, J.A.,
Private communication (see http://webbook.nist.gov/chemistry/om/). [all data]
Lappert, Patil, et al., 1975
Lappert, M.F.; Patil, D.S.; Pedley, J.B.,
J. Chem. Soc., Chem. Commun., 1975, 830.. [all data]
Lappert, Pedley, et al., 1974
Lappert, M.F.; Pedley, J.B.; Sharp, G.,
Bonding studies of transition metal complexes. I. He(I) photoelectron spectra of d0 silylmethyl and neopentyl derivatives of Group IVA metals,
J. Organomet. Chem., 1974, 66, 271. [all data]