Ethanone, 2-bromo-1-(4-nitrophenyl)-
- Formula: C10H12BrNO
- Molecular weight: 242.112
- IUPAC Standard InChIKey: MBUPVGIGAMCMBT-UHFFFAOYSA-N
- CAS Registry Number: 37904-72-6
- Chemical structure:
View 3d structure (requires JavaScript / HTML 5) - Species with the same structure:

Gas phase ion energetics data

Data compiled by: Sharon G. Lias, John E. Bartmess, Joel F. Liebman, John L. Holmes, Rhoda D. Levin, and W. Gary Mallard
Ionization energy determinations
IE (eV) | Method | Reference | Comment |
---|---|---|---|
7.7 | PE | Distefano, Granozzi, et al., 1987 | Vertical value |

References

Distefano, Granozzi, et al., 1987
Distefano, G.; Granozzi, G.; Olivato, P.R.; Guerrero, S.A.,
Hyperconjugative interactions in halogen-substituted carbonyls: Ultraviolet photoelectron spectroscopy of w-halogenoacetophenones,
J. Chem. Soc. Perkin Trans. 2, 1987, 1459. [all data]