Silane, dimethyl-phenyl-(trimethylgermyl)-

Gas phase ion energetics data

Data compiled by: Sharon G. Lias, John E. Bartmess, Joel F. Liebman, John L. Holmes, Rhoda D. Levin, and W. Gary Mallard

Ionization energy determinations

IE (eV) Method Reference
8.37PESakurai, Ichinose, et al., 1984
8.40CTSakurai, Ichinose, et al., 1984

References

Sakurai, Ichinose, et al., 1984
Sakurai, H.; Ichinose, M.; Kira, M.; Traylor, T.G., Ultraviolet, charge-transfer, and photoelectron spectra of phenyl-substituted Group 4B catenates, PhMe2E-E'Me3 (E = Si, Ge; E' = C, Si, Ge, Sn), Chem. Lett., 1984, 1383. [all data]