1,3-Dioxol-2-one,4,5-dimethyl-
- Formula: C5H6O3
- Molecular weight: 114.0993
- IUPAC Standard InChIKey: QYIOFABFKUOIBV-UHFFFAOYSA-N
- CAS Registry Number: 37830-90-3
- Chemical structure:
View 3d structure (requires JavaScript / HTML 5) - Other names: 4,5-Dimethyl-1,3-dioxol-2-one

Gas phase ion energetics data

Data compiled by: Sharon G. Lias, Rhoda D. Levin, and Sherif A. Kafafi
Ionization energy determinations
IE (eV) | Method | Reference | Comment |
---|---|---|---|
9.10 | PE | Wittel, Astrup, et al., 1975 | Vertical value |

References

Wittel, Astrup, et al., 1975
Wittel, K.; Astrup, E.E.; Bock, H.; Graeffe, G.; Juslen, H.,
Photoelectron spectra and molecular properties, XLVIII Carbonates thio- carbonates,
Z. Naturforsch. B:, 1975, 30, 862. [all data]