Benzoic acid, 4-(phenylazo)-(E)-
- Formula: C13H10N2O2
- Molecular weight: 226.2307
- IUPAC Standard InChIKey: CSPTZWQFHBVOLO-CCEZHUSRSA-N
- CAS Registry Number: 37790-20-8
- Chemical structure:
View 3d structure (requires JavaScript / HTML 5) - Stereoisomers:

Gas phase ion energetics data

Data compiled as indicated in comments:
LLK - Sharon G. Lias, Rhoda D. Levin, and Sherif A. Kafafi
Ionization energy determinations
IE (eV) | Method | Reference | Comment |
---|---|---|---|
8.3 | PE | Millefiori, Millefiori, et al., 1979 | LLK |
~8.75 | PE | Millefiori, Millefiori, et al., 1979 | Vertical value; LLK |

References

Millefiori, Millefiori, et al., 1979
Millefiori, S.; Millefiori, A.; Pignataro, S.; Distefano, G.; Colonna, F.P.,
Gas phase UPS investigation of trans-azobenzenes,
Z. Naturforsch. A:, 1979, 34, 1496. [all data]