Cyclopentene-1-d

Gas phase ion energetics data

Data compiled by: Sharon G. Lias, Rhoda D. Levin, and Sherif A. Kafafi

Appearance energy determinations

Ion AE (eV) Other Products MethodReferenceComment
C5H6D+10.98 ± 0.03HEIHolmes, 1974
C5H7+11.03 ± 0.03DEIHolmes, 1974

References

Holmes, 1974
Holmes, J.L., The mass spectra of isomeric hydrocarbons - II: The C5H8 isomers, spiropentane, cyclopentene, 1,3-pentadiene and isoprene; the mechanisms and energetics of their fragmentations, Org. Mass Spectrom., 1974, 8, 247. [all data]