sulphinylbis(dimethylamide)
- Formula: C4H12N2OS
- Molecular weight: 136.216
- CAS Registry Number: 3768-60-3

Phase change data

Data compiled by: William E. Acree, Jr., James S. Chickos
Enthalpy of vaporization
ΔvapH (kJ/mol) | Temperature (K) | Method | Reference | Comment |
---|---|---|---|---|
41.9 | 335. | A | Stephenson and Malanowski, 1987 | Based on data from 320. to 351. K. See also Dykyj, Svoboda, et al., 1999. |

Gas phase ion energetics data

Data compiled by: Sharon G. Lias, Rhoda D. Levin, and Sherif A. Kafafi
Ionization energy determinations
IE (eV) | Method | Reference | Comment |
---|---|---|---|
8.53 | PE | Bock and Solouki, 1974 | Vertical value |
8.53 | PE | Bock and Solouki, 1972 | Vertical value |

References

Stephenson and Malanowski, 1987
Stephenson, Richard M.; Malanowski, Stanislaw,
Handbook of the Thermodynamics of Organic Compounds, 1987, https://doi.org/10.1007/978-94-009-3173-2
. [all data]
Dykyj, Svoboda, et al., 1999
Dykyj, J.; Svoboda, J.; Wilhoit, R.C.; Frenkel, M.L.; Hall, K.R.,
Vapor Pressure of Chemicals: Part A. Vapor Pressure and Antoine Constants for Hydrocarbons and Sulfur, Selenium, Tellurium and Hydrogen Containing Organic Compounds, Springer, Berlin, 1999, 373. [all data]
Bock and Solouki, 1974
Bock, H.; Solouki, B.,
Photoelektronenspektren und molekuleigenschaften, XXXV. Sulfoxide X2SO - beispiele fur den nutzen von korrelations - diagrammen bei der diskussion von substituenteneffekten und von geometrischen storungen,
Chem. Ber., 1974, 107, 2299. [all data]
Bock and Solouki, 1972
Bock, H.; Solouki, B.,
The sulfoxide bond,
Angew. Chem. Int. Ed. Engl., 1972, 11, 436. [all data]