1H-Cyclopropa[l]phenanthrene,1,1-dichloro-1a,9b-dihydro-
- Formula: C15H10Cl2
- Molecular weight: 261.146
- IUPAC Standard InChIKey: HQGMQJUEHLYMOY-UHFFFAOYSA-N
- CAS Registry Number: 37608-29-0
- Chemical structure:
View 3d structure (requires JavaScript / HTML 5) - Permanent link for this species. Use this link for bookmarking this species for future reference.

Gas phase ion energetics data

Data compiled by: Sharon G. Lias, Rhoda D. Levin, and Sherif A. Kafafi
Ionization energy determinations
IE (eV) | Method | Reference | Comment |
---|---|---|---|
11.41 | EI | Lossing, 1972 | |
8.06 | PE | Shudo, Kobayashi, et al., 1977 | Vertical value |
11.48 | PE | Nicholson and Rademacher, 1974 | Vertical value |

References

Lossing, 1972
Lossing, F.P.,
Free radicals by mass spectrometry. XLIV. Ionization potentials bond dissociation energies for chloro-and fluoromethyl radicals,
Bull. Soc. Chim. Belg., 1972, 81, 125. [all data]
Shudo, Kobayashi, et al., 1977
Shudo, K.; Kobayashi, T.; Utsunomiya, C.,
Photoelectron spectral studies on the interaction of three-membered rings with aryl groups,
Tetrahedron, 1977, 33, 1721. [all data]
Nicholson and Rademacher, 1974
Nicholson, D.G.; Rademacher, P.,
Photoelectron spectra and electronic structures of antimony(III) halides,
Acta Chem. Scand. Ser. A:, 1974, 28, 1136. [all data]