1,3-Dioxole-2-thione,4,5-dimethyl-
- Formula: C5H6O2S
- Molecular weight: 130.165
- IUPAC Standard InChIKey: FOAPIIABPNSDMV-UHFFFAOYSA-N
- CAS Registry Number: 37528-00-0
- Chemical structure:
View 3d structure (requires JavaScript / HTML 5) - Permanent link for this species. Use this link for bookmarking this species for future reference.

Gas phase ion energetics data

Data compiled by: Sharon G. Lias, Rhoda D. Levin, and Sherif A. Kafafi
Ionization energy determinations
IE (eV) | Method | Reference | Comment |
---|---|---|---|
8.4 | PE | Wittel, Astrup, et al., 1975 | Vertical value |

References

Wittel, Astrup, et al., 1975
Wittel, K.; Astrup, E.E.; Bock, H.; Graeffe, G.; Juslen, H.,
Photoelectron spectra and molecular properties, XLVIII Carbonates thio- carbonates,
Z. Naturforsch. B:, 1975, 30, 862. [all data]