Methanone,(1-methyl-1H-pyrrol-2-yl)phenyl-
- Formula: C12H11NO
- Molecular weight: 185.2218
- IUPAC Standard InChIKey: YLDDGZQCRPTKIH-UHFFFAOYSA-N
- CAS Registry Number: 37496-06-3
- Chemical structure:
View 3d structure (requires JavaScript / HTML 5) - Permanent link for this species. Use this link for bookmarking this species for future reference.

Gas phase ion energetics data

Data compiled by: Sharon G. Lias, Rhoda D. Levin, and Sherif A. Kafafi
Ionization energy determinations
IE (eV) | Method | Reference |
---|---|---|
8.7 ± 0.1 | EI | Grutzmacher and Schubert, 1979 |
Appearance energy determinations
Ion | AE (eV) | Other Products | Method | Reference | Comment |
---|---|---|---|---|---|
C6H6NO+ | 12.2 ± 0.1 | C6H5 | EI | Grutzmacher and Schubert, 1979 | |
C7H5O+ | 13.1 ± 0.1 | ? | EI | Grutzmacher and Schubert, 1979 |

References

Grutzmacher and Schubert, 1979
Grutzmacher, H.-F.; Schubert, R.,
Substituent effects in the mass spectra of benzoyl hetarenes,
Org. Mass Spectrom., 1979, 14, 567. [all data]