trivinylphosphine
- Formula: C6H9P
- Molecular weight: 112.1094
- IUPAC Standard InChIKey: OZHUWVSXUOMDDU-UHFFFAOYSA-N
- CAS Registry Number: 3746-01-8
- Chemical structure:
View 3d structure (requires JavaScript / HTML 5) - Permanent link for this species. Use this link for bookmarking this species for future reference.

Phase change data

Data compiled as indicated in comments:
AC - William E. Acree, Jr., James S. Chickos
Enthalpy of vaporization
ΔvapH (kJ/mol) | Temperature (K) | Reference | Comment |
---|---|---|---|
33.7 | 304. | Maier, Seyferth, et al., 1957 | Based on data from 289. to 334. K. See also Boublik, Fried, et al., 1984.; AC |
Antoine Equation Parameters
log10(P) = A − (B / (T + C))
P = vapor pressure (bar)
T = temperature (K)
View plot Requires a JavaScript / HTML 5 canvas capable browser.
Temperature (K) | A | B | C | Reference | Comment |
---|---|---|---|---|---|
289.4 to 334.1 | 5.13152 | 2157.87 | 32.805 | Maier, Seyferth, et al., 1957 | Coefficents calculated by NIST from author's data. |

Gas phase ion energetics data

Data compiled by: Sharon G. Lias, Rhoda D. Levin, and Sherif A. Kafafi
Ionization energy determinations
IE (eV) | Method | Reference | Comment |
---|---|---|---|
8.51 | PE | Weiner and Lattman, 1978 | Vertical value |

References

Maier, Seyferth, et al., 1957
Maier, Ludwig; Seyferth, Dietmar; Stone, F.G.A.; Rochow, Eugene G.,
Vinyl Derivatives of the Metals. VI. Preparation, Properties and Some Reactions of Trivinyl Compounds of Group V Elements 1,2,
J. Am. Chem. Soc., 1957, 79, 22, 5884-5889, https://doi.org/10.1021/ja01579a012
. [all data]
Boublik, Fried, et al., 1984
Boublik, T.; Fried, V.; Hala, E.,
The Vapour Pressures of Pure Substances: Selected Values of the Temperature Dependence of the Vapour Pressures of Some Pure Substances in the Normal and Low Pressure Region, 2nd ed., Elsevier, New York, 1984, 972. [all data]
Weiner and Lattman, 1978
Weiner, M.A.; Lattman, M.,
Ultraviolet photoelectron spectra of some Cr(CO)5L complexes containing organosulfide and organophosphine ligands,
Inorg. Chem., 1978, 17, 1084. [all data]