1,3,2-Dioxathiolane, 2-oxide
- Formula: C2H4O3S
- Molecular weight: 108.116
- IUPAC Standard InChIKey: WDXYVJKNSMILOQ-UHFFFAOYSA-N
- CAS Registry Number: 3741-38-6
- Chemical structure:
View 3d structure (requires JavaScript / HTML 5) - Other names: Ethylene glycol, cyclic sulfite; Cyclic ethylene sulfite; Ethylene sulfite; Glycol sulfite; NSC 3225; 1,2-Ethylene sulfite; Sulfurous acid, cyclic ester with ethylene glycol; ethylene sulphite

Reaction thermochemistry data

Data compiled by: Robert C. Dunbar
Individual Reactions
By formula: Li+ + C2H4O3S = (Li+ • C2H4O3S)
Quantity | Value | Units | Method | Reference | Comment |
---|---|---|---|---|---|
ΔrH° | 199. | kJ/mol | CIDC | Buncel, Decouzon, et al., 1997 |

Gas phase ion energetics data

Data compiled as indicated in comments:
LLK - Sharon G. Lias, Rhoda D. Levin, and Sherif A. Kafafi
B - John E. Bartmess
Electron affinity determinations
EA (eV) | Reference | Comment |
---|---|---|
0.013488 ± 0.000087 | Hammer, Diri, et al., 2003 | B |
Ionization energy determinations
IE (eV) | Method | Reference | Comment |
---|---|---|---|
10.30 ± 0.05 | EI | Distefano, Foffani, et al., 1971 | LLK |
10.30 | EI | Distefano, Foffani, et al., 1971, 2 | LLK |
10.93 | PE | Bock and Solouki, 1974 | Vertical value; LLK |
10.93 | PE | Bock and Solouki, 1972 | Vertical value; LLK |

Ion clustering data

Data compiled by: Robert C. Dunbar
Clustering reactions
By formula: Li+ + C2H4O3S = (Li+ • C2H4O3S)
Quantity | Value | Units | Method | Reference | Comment |
---|---|---|---|---|---|
ΔrH° | 199. | kJ/mol | CIDC | Buncel, Decouzon, et al., 1997 |

References

Buncel, Decouzon, et al., 1997
Buncel, E.; Decouzon, M.; Formento, A.; Gal, J.-F.; Herreros, M.; Li, L.; Maria, P.-C.,
Lithium-Cation and Proton Affinities of Sulfoxides and Sulfones: A Fourier Transform Ion Cyclotron Resonance Study,
J. Am. Soc. Mass Spectrom., 1997, 8, 3, 262, https://doi.org/10.1016/S1044-0305(96)00255-3
. [all data]
Hammer, Diri, et al., 2003
Hammer, N.I.; Diri, K.; Jordan, K.D.; Desfrancois, C.; Compton, R.N.,
Dipole-bound anions of carbonyl, nitrile, and sulfoxide containing molecules,
J. Chem. Phys., 2003, 119, 7, 3650-3660, https://doi.org/10.1063/1.1590959
. [all data]
Distefano, Foffani, et al., 1971
Distefano, G.; Foffani, A.; Innorta, G.; Pignataro, S.,
Mass spectrometric study of transition metal complexes with ligands having nitrogen or sulphur as donor atom,
Adv. Mass Spectrom., 1971, 5, 696. [all data]
Distefano, Foffani, et al., 1971, 2
Distefano, G.; Foffani, A.; Innorta, G.; Pignataro, S.,
Electron impact ionization potentials of some manganese, chromium and tungsten organometallic derivatives,
Int. J. Mass Spectrom. Ion Phys., 1971, 7, 383. [all data]
Bock and Solouki, 1974
Bock, H.; Solouki, B.,
Photoelektronenspektren und molekuleigenschaften, XXXV. Sulfoxide X2SO - beispiele fur den nutzen von korrelations - diagrammen bei der diskussion von substituenteneffekten und von geometrischen storungen,
Chem. Ber., 1974, 107, 2299. [all data]
Bock and Solouki, 1972
Bock, H.; Solouki, B.,
The sulfoxide bond,
Angew. Chem. Int. Ed. Engl., 1972, 11, 436. [all data]