2(1H)Pyrimidinone,1-methyl-
- Formula: C5H6N2O
- Molecular weight: 110.1139
- IUPAC Standard InChIKey: LQKMCBPMBNUKSU-UHFFFAOYSA-N
- CAS Registry Number: 3739-81-9
- Chemical structure:
View 3d structure (requires JavaScript / HTML 5) - Other names: 1,2-Dihydropyrimidin-2-one, 1-methyl-

Gas phase ion energetics data

Data compiled by: Sharon G. Lias, Rhoda D. Levin, and Sherif A. Kafafi
Ionization energy determinations
IE (eV) | Method | Reference |
---|---|---|
9.31 ± 0.05 | EI | Gacek, Thorstad, et al., 1978 |

References

Gacek, Thorstad, et al., 1978
Gacek, M.; Thorstad, O.; Ongstad, L.; Undheim, K.,
Ionisation potentials in tautomer analysis of 2-hydroxypyrimidines,
Chem. Scr., 1978, 13, 99. [all data]