Carbamodithioic acid, dimethyl-, methyl ester
- Formula: C4H9NS2
- Molecular weight: 135.251
- IUPAC Standard InChIKey: NBBZMDUHKWRYSZ-UHFFFAOYSA-N
- CAS Registry Number: 3735-92-0
- Chemical structure:
View 3d structure (requires JavaScript / HTML 5) - Other names: Carbamic acid, dimethyldithio-, methyl ester; Cystogon; Forbiat; Methyl dimethyldithiocarbamate; Methyl N,N-dimethyldithiocarbamate; Dimethyldithiocarbamic acid methyl ester

Condensed phase thermochemistry data

Data compiled by: Hussein Y. Afeefy, Joel F. Liebman, and Stephen E. Stein
Quantity | Value | Units | Method | Reference | Comment |
---|---|---|---|---|---|
ΔfH°solid | -66.9 | kJ/mol | Ccb | Delephine, 1903 | |
Quantity | Value | Units | Method | Reference | Comment |
ΔcH°solid | -3991. | kJ/mol | Ccb | Delephine, 1903 |

Gas phase ion energetics data

Data compiled by: Sharon G. Lias, Rhoda D. Levin, and Sherif A. Kafafi
Ionization energy determinations
IE (eV) | Method | Reference | Comment |
---|---|---|---|
8.01 ± 0.03 | PE | Guimon, Pfister-Guillouzo, et al., 1974 | |
8.01 | PE | Guimon, Gonbeau, et al., 1974 | Vertical value |

References

Delephine, 1903
Delephine, M.,
Chalcurs de formation de quelques composes sulfuris et azoles,
Compt. Rend., 1903, 136, 451-453. [all data]
Guimon, Pfister-Guillouzo, et al., 1974
Guimon, C.; Pfister-Guillouzo, G.; Arbelot, M.; Chanon, M.,
Electronic structure of sulphur compounds. VII. Photoelectron spectra of thiocarbonyl J. Heterocycl. Chem..,
Tetrahedron, 1974, 30, 3831. [all data]
Guimon, Gonbeau, et al., 1974
Guimon, C.; Gonbeau, D.; Pfister-Guillouzo, G.; Asbrink, L.; Sandstrom, J.,
Electronic structure of sulphur compounds. VI. Photoelectron spectra of some simple thiocarbonyl compounds,
J. Electron Spectrosc. Relat. Phenom., 1974, 4, 49. [all data]