Molybdenum,bis(η5-2,4-cyclopentadien-1-yl)(η2-ethene)-
- Formula: C12H14Mo
- Molecular weight: 254.20
- CAS Registry Number: 37343-05-8

Gas phase thermochemistry data

Data compiled by: José A. Martinho Simões
Quantity | Value | Units | Method | Reference | Comment |
---|---|---|---|---|---|
ΔfH°gas | 87.2 ± 3.1 | kcal/mol | Review | Martinho Simões | The enthalpy of formation relies on 17.3 ± 1.9 kcal/mol for the enthalpy of formation of Mo(Cp)2(I)2(cr) |

Reaction thermochemistry data

Data compiled by: José A. Martinho Simões
Individual Reactions
C12H14Mo (cr) + (cr) = C10H10I2Mo (cr) +
(g)
By formula: C12H14Mo (cr) + I2 (cr) = C10H10I2Mo (cr) + C2H4 (g)
Quantity | Value | Units | Method | Reference | Comment |
---|---|---|---|---|---|
ΔrH° | -38.96 ± 0.50 | kcal/mol | RSC | Calhorda, Carrondo, et al., 1991 |

Gas phase ion energetics data

Data compiled by: Sharon G. Lias, Rhoda D. Levin, and Sherif A. Kafafi
Ionization energy determinations
IE (eV) | Method | Reference | Comment |
---|---|---|---|
6.0 ± 0.1 | PE | Green, Jackson, et al., 1975 | Vertical value |

Condensed phase thermochemistry data

Data compiled by: José A. Martinho Simões
Quantity | Value | Units | Method | Reference | Comment |
---|---|---|---|---|---|
ΔfH°solid | 68.8 ± 2.0 | kcal/mol | Review | Martinho Simões | The enthalpy of formation relies on 17.3 ± 1.9 kcal/mol for the enthalpy of formation of Mo(Cp)2(I)2(cr) |

Phase change data

Data compiled by: José A. Martinho Simões

Quantity Value Units Method Reference Comment
Δsub77. ± 10.kJ/molRSCCalhorda, Carrondo, et al., 1991

References

Martinho Simões
Martinho Simões, J.A.,
Private communication (see http://webbook.nist.gov/chemistry/om/). [all data]
Calhorda, Carrondo, et al., 1991
Calhorda, M.J.; Carrondo, M.A.A.F.C.T.; Dias, A.R.; Galvão, A.M.; Garcia, M.H.; Martins, A.M.; Minas da Piedade, M.E.; Pinheiro, C.I.; Romão, C.C.; Martinho Simões, J.A.; Veiros, L.F.,
Organometallics, 1991, 10, 483. [all data]
Green, Jackson, et al., 1975
Green, J.C.; Jackson, S.E.; Higginson, B.,
Photoelectron studies of some bent bis(n-cyclopentadienyl)metal complexes. Part I. Some eighteen-electron systems with hydride, alkyl, olefin, allyl, carbonyl ligands,
J. Chem. Soc. Dalton Trans., 1975, 403. [all data]