1-Azabicyclo[2.2.2]octan-3-one
- Formula: C7H11NO
- Molecular weight: 125.1683
- IUPAC Standard InChIKey: ZKMZPXWMMSBLNO-UHFFFAOYSA-N
- CAS Registry Number: 3731-38-2
- Chemical structure:
View 3d structure (requires JavaScript / HTML 5) - Other names: 3-Quinuclidinone; 3-Oxoquinuclidine; 3-Quinuclidone; MKC-2; Quinuclidone 3; Quinuclidin-3-one; NSC 168448

Gas phase ion energetics data

Data evaluated as indicated in comments:
HL - Edward P. Hunter and Sharon G. Lias
Data compiled as indicated in comments:
LLK - Sharon G. Lias, Rhoda D. Levin, and Sherif A. Kafafi
Quantity | Value | Units | Method | Reference | Comment |
---|---|---|---|---|---|
Proton affinity (review) | 936.0 | kJ/mol | N/A | Hunter and Lias, 1998 | HL |
Quantity | Value | Units | Method | Reference | Comment |
Gas basicity | 905.2 | kJ/mol | N/A | Hunter and Lias, 1998 | HL |
Ionization energy determinations
IE (eV) | Method | Reference | Comment |
---|---|---|---|
8.2 | PE | Aue and Bowers, 1979 | Vertical value; LLK |

References

Hunter and Lias, 1998
Hunter, E.P.; Lias, S.G.,
Evaluated Gas Phase Basicities and Proton Affinities of Molecules: An Update,
J. Phys. Chem. Ref. Data, 1998, 27, 3, 413-656, https://doi.org/10.1063/1.556018
. [all data]
Aue and Bowers, 1979
Aue, D.H.; Bowers, M.T.,
Chapter 9. Stabilities of positive ions from equilibrium gas phase basicity measurements
in Ions Chemistry,, ed. M.T. Bowers, 1979. [all data]