Dilithium diiodide
- Formula: I2Li2
- Molecular weight: 267.691
- CAS Registry Number: 37279-36-0

Gas phase thermochemistry data

Quantity | Value | Units | Method | Reference | Comment |
---|---|---|---|---|---|
ΔfH°gas | -361.92 | kJ/mol | Review | Chase, 1998 | Data last reviewed in June, 1966 |
Quantity | Value | Units | Method | Reference | Comment |
S°gas,1 bar | 330.61 | J/mol*K | Review | Chase, 1998 | Data last reviewed in June, 1966 |
Gas Phase Heat Capacity (Shomate Equation)
Cp° = A + B*t + C*t2 + D*t3 +
E/t2
H° − H°298.15= A*t + B*t2/2 +
C*t3/3 + D*t4/4 − E/t + F − H
S° = A*ln(t) + B*t + C*t2/2 + D*t3/3 −
E/(2*t2) + G
Cp = heat capacity (J/mol*K)
H° = standard enthalpy (kJ/mol)
S° = standard entropy (J/mol*K)
t = temperature (K) / 1000.
View plot Requires a JavaScript / HTML 5 canvas capable browser.
Temperature (K) | 298. to 6000. |
---|---|
A | 82.77542 |
B | 0.315711 |
C | -0.085710 |
D | 0.007323 |
E | -0.611910 |
F | -388.6614 |
G | 427.2533 |
H | -361.9164 |
Reference | Chase, 1998 |
Comment | Data last reviewed in June, 1966 |

Gas phase ion energetics data

Data compiled as indicated in comments:
LLK - Sharon G. Lias, Rhoda D. Levin, and Sherif A. Kafafi
RDSH - Henry M. Rosenstock, Keith Draxl, Bruce W. Steiner, and John T. Herron
Ionization energy determinations
IE (eV) | Method | Reference | Comment |
---|---|---|---|
9.23 ± 0.06 | PE | Potts and Lee, 1979 | Vertical value; LLK |
Appearance energy determinations
Ion | AE (eV) | Other Products | Method | Reference | Comment |
---|---|---|---|---|---|
Li2I+ | 9.2 ± 0.3 | I | EI | Platel, 1965 | RDSH |
Li+ | 11.6 ± 0.3 | ? | EI | Platel, 1965 | RDSH |
Li+ | 11.75 ± 0.20 | LiI+I | EI | Friedman, 1955 | RDSH |

References

Chase, 1998
Chase, M.W., Jr.,
NIST-JANAF Themochemical Tables, Fourth Edition,
J. Phys. Chem. Ref. Data, Monograph 9, 1998, 1-1951. [all data]
Potts and Lee, 1979
Potts, A.W.; Lee, E.P.F.,
Photoelectron spectra and electronic structure of lithium halide monomers and dimers,
J. Chem. Soc. Faraday Trans. 2, 1979, 75, 941. [all data]
Platel, 1965
Platel, G.,
Mesures des potentials d'apparition des ions obtenus par impact electronique dans la phase vapeur des iodures alcalins et des melanges LiI-MI,
J. Chim. Phys., 1965, 62, 1176. [all data]
Friedman, 1955
Friedman, L.,
Mass spectrum of lithium iodide,
J. Chem. Phys., 1955, 23, 477. [all data]