Disulfide, bis(trifluoromethyl)
- Formula: C2F6S2
- Molecular weight: 202.142
- IUPAC Standard InChIKey: CGMFFOXAQVRUAZ-UHFFFAOYSA-N
- CAS Registry Number: 372-64-5
- Chemical structure:
View 3d structure (requires JavaScript / HTML 5) - Other names: Bis(trifluoromethyl) disulfide; Perfluorodimethyl disulfide; Trifluoromethyl disulfide; di(Trifluoromethyl)disulfide; Di(methyl) disulfide, perfluoro-

Phase change data

Data compiled by: Robert L. Brown and Stephen E. Stein
Quantity | Value | Units | Method | Reference | Comment |
---|---|---|---|---|---|
Tboil | 307. to 308. | K | N/A | PCR Inc., 1990 | |
Tboil | 307.7 | K | N/A | Weast and Grasselli, 1989 |

Gas phase ion energetics data

Data compiled by: Henry M. Rosenstock, Keith Draxl, Bruce W. Steiner, and John T. Herron
Ionization energy determinations
IE (eV) | Method | Reference |
---|---|---|
10.68 ± 0.19 | EI | Cullen, Frost, et al., 1970 |
10.60 ± 0.03 | PE | Cullen, Frost, et al., 1969 |
Appearance energy determinations
Ion | AE (eV) | Other Products | Method | Reference | Comment |
---|---|---|---|---|---|
CF+ | 16. | ? | EI | Cullen, Frost, et al., 1970 | |
CFS2+ | 15.60 ± 0.10 | ? | EI | Cullen, Frost, et al., 1970 | |
CF2S+ | 10.93 ± 0.17 | ? | EI | Cullen, Frost, et al., 1970 | |
CF2S2+ | 11.28 ± 0.06 | CF4 | EI | Cullen, Frost, et al., 1970 | |
CF3+ | 12.07 ± 0.13 | ? | EI | Cullen, Frost, et al., 1970 | |
CF3S+ | 14.43 ± 0.08 | ? | EI | Cullen, Frost, et al., 1970 | |
CF3S2+ | 13.31 ± 0.05 | CF3 | EI | Cullen, Frost, et al., 1970 | |
C2F5S2+ | 14.64 ± 0.07 | F | EI | Cullen, Frost, et al., 1970 | |
S+ | ~13. | ? | EI | Cullen, Frost, et al., 1970 | |
S2+ | 13.22 ± 0.17 | ? | EI | Cullen, Frost, et al., 1970 |

References

PCR Inc., 1990
PCR Inc.,
Research Chemicals Catalog 1990-1991, PCR Inc., Gainesville, FL, 1990, 1. [all data]
Weast and Grasselli, 1989
CRC Handbook of Data on Organic Compounds, 2nd Editon, Weast,R.C and Grasselli, J.G., ed(s)., CRC Press, Inc., Boca Raton, FL, 1989, 1. [all data]
Cullen, Frost, et al., 1970
Cullen, W.R.; Frost, D.C.; Pun, M.T.,
Mass spectra, appearance potentials, heats of formation, and bond energies of some alkyl and perfluoroalkyl sulfides,
Inorg. Chem., 1970, 9, 1976. [all data]
Cullen, Frost, et al., 1969
Cullen, W.R.; Frost, D.C.; Vroom, D.A.,
Ionization potentials of some sulfur compounds,
Inorg. Chem., 1969, 8, 1803. [all data]