(E,E)-1,3,5,7-Octatetraene
- Formula: C8H10
- Molecular weight: 106.1650
- IUPAC Standard InChIKey: VXQUABLSXKFKLO-KQQUZDAGSA-N
- CAS Registry Number: 3725-31-3
- Chemical structure:
View 3d structure (requires JavaScript / HTML 5) - Species with the same structure:
- Stereoisomers:

Gas phase thermochemistry data

Data compiled by: Glushko Thermocenter, Russian Academy of Sciences, Moscow
Constant pressure heat capacity of gas
Cp,gas (J/mol*K) | Temperature (K) | Reference | Comment |
---|---|---|---|
48.11 | 50. | Thermodynamics Research Center, 1997 | |
69.38 | 100. | ||
88.07 | 150. | ||
106.29 | 200. | ||
135.08 | 273.15 | ||
145.32 | 298.15 | ||
146.07 | 300. | ||
185.70 | 400. | ||
220.06 | 500. | ||
248.45 | 600. | ||
271.94 | 700. | ||
291.64 | 800. | ||
308.34 | 900. | ||
322.6 | 1000. | ||
334.9 | 1100. | ||
345.5 | 1200. | ||
354.6 | 1300. | ||
362.5 | 1400. | ||
369.3 | 1500. |

Gas phase ion energetics data

Data compiled as indicated in comments:
LLK - Sharon G. Lias, Rhoda D. Levin, and Sherif A. Kafafi
Ionization energy determinations
IE (eV) | Method | Reference | Comment |
---|---|---|---|
7.79 ± 0.02 | PE | Jones and Maier, 1979 | LLK |

References

Thermodynamics Research Center, 1997
Thermodynamics Research Center,
Selected Values of Properties of Chemical Compounds., Thermodynamics Research Center, Texas A&M University, College Station, Texas, 1997. [all data]
Jones and Maier, 1979
Jones, T.B.; Maier, J.P.,
Study of the radical cation of all trans-1,3,5,7-octatetraene by its emission, A2Au → X2Bg, by photoelectron spectroscopy,
Int. J. Mass Spectrom. Ion Phys., 1979, 31, 287. [all data]