1,3,6-Cyclooctatriene
- Formula: C8H10
- Molecular weight: 106.1650
- IUPAC Standard InChIKey: LHNSMWDERKGLJK-DKPWQKSPSA-N
- CAS Registry Number: 3725-30-2
- Chemical structure:
View 3d structure (requires JavaScript / HTML 5) - Other names: 1,4,6-Cyclooctatriene

Gas phase thermochemistry data

Data compiled by: Hussein Y. Afeefy, Joel F. Liebman, and Stephen E. Stein
Quantity | Value | Units | Method | Reference | Comment |
---|---|---|---|---|---|
ΔfH°gas | 196.3 | kJ/mol | Eqk | Greathead and Orchard, 1983 |

Phase change data

Data compiled as indicated in comments:
BS - Robert L. Brown and Stephen E. Stein
TRC - Thermodynamics Research Center, NIST Boulder Laboratories, Chris Muzny director
Quantity | Value | Units | Method | Reference | Comment |
---|---|---|---|---|---|
Tfus | 214. | K | N/A | Cope and Hochstein, 1950 | Uncertainty assigned by TRC = 8. K; TRC |
Reduced pressure boiling point
Tboil (K) | Pressure (bar) | Reference | Comment |
---|---|---|---|
341.2 | 0.080 | Weast and Grasselli, 1989 | BS |

Reaction thermochemistry data

Data compiled by: Hussein Y. Afeefy, Joel F. Liebman, and Stephen E. Stein
Individual Reactions
By formula: 3H2 + C8H10 = C8H16
Quantity | Value | Units | Method | Reference | Comment |
---|---|---|---|---|---|
ΔrH° | -334.3 ± 0.71 | kJ/mol | Chyd | Turner, Mallon, et al., 1973 | liquid phase; solvent: Glacial acetic acid |
By formula: C8H10 = C8H10
Quantity | Value | Units | Method | Reference | Comment |
---|---|---|---|---|---|
ΔrH° | -13.6 ± 0.2 | kJ/mol | Eqk | Greathead and Orchard, 1983 | gas phase |

Gas phase ion energetics data

Data compiled as indicated in comments:
LLK - Sharon G. Lias, Rhoda D. Levin, and Sherif A. Kafafi
Ionization energy determinations
IE (eV) | Method | Reference | Comment |
---|---|---|---|
8.5 | PE | Batich, Bischof, et al., 1973 | LLK |

References

Greathead and Orchard, 1983
Greathead, J.M.; Orchard, S.W.,
Kinetic and equilibrium study of gas-phase interconversions of 1,3,6-cyclooctatriene, 1,3,5-cyclooctatriene and bicyclo[4.2.0]octa-2,4-diene,
Int. J. Chem. Kinet., 1983, 15, 1069-1080. [all data]
Cope and Hochstein, 1950
Cope, A.C.; Hochstein, F.A.,
Cyclic Polyolefins VI. Preparation of Cyclooctatrienes from \ Cyclooctatetraene,
J. Am. Chem. Soc., 1950, 72, 2515-20. [all data]
Weast and Grasselli, 1989
CRC Handbook of Data on Organic Compounds, 2nd Editon, Weast,R.C and Grasselli, J.G., ed(s)., CRC Press, Inc., Boca Raton, FL, 1989, 1. [all data]
Turner, Mallon, et al., 1973
Turner, R.B.; Mallon, B.J.; Tichy, M.; Doering, W.v.E.; Roth, W.R.; Schroder, G.,
Heats of hydrogenation. X. Conjugative interaction in cyclic dienes and trienes,
J. Am. Chem. Soc., 1973, 95, 8605-8610. [all data]
Batich, Bischof, et al., 1973
Batich, C.; Bischof, P.; Heilbronner, E.,
The photoelectron spectra of cyclooctatetraene and its hydrogenated derivatives,
J. Electron Spectrosc. Relat. Phenom., 1973, 1, 333. [all data]
Cope and Hochstein, 1950, 2
Cope, A.C.; Hochstein, F.A.,
J. Am. Chem. Soc., 1950, 72, 2515. [all data]