Bicyclo[4.2.0]octa-2,4-diene
- Formula: C8H10
- Molecular weight: 106.1650
- IUPAC Standard InChIKey: JTIKVKRPISBACC-UHFFFAOYSA-N
- CAS Registry Number: 3725-28-8
- Chemical structure:
View 3d structure (requires JavaScript / HTML 5) - Permanent link for this species. Use this link for bookmarking this species for future reference.

Gas phase thermochemistry data

Data compiled by: Hussein Y. Afeefy, Joel F. Liebman, and Stephen E. Stein
Quantity | Value | Units | Method | Reference | Comment |
---|---|---|---|---|---|
ΔfH°gas | 189.2 | kJ/mol | Chyd | Roth, Adamczak, et al., 1991 | |
ΔfH°gas | 183.3 | kJ/mol | Eqk | Greathead and Orchard, 1983 |

Reaction thermochemistry data

Data compiled by: Hussein Y. Afeefy, Joel F. Liebman, and Stephen E. Stein
Individual Reactions
By formula: 2H2 + C8H10 = C8H14
Quantity | Value | Units | Method | Reference | Comment |
---|---|---|---|---|---|
ΔrH° | -216.0 ± 0.4 | kJ/mol | Chyd | Turner, Goebel, et al., 1968 | liquid phase; solvent: Acetic acid |
C8H10N2O = +
By formula: C8H10N2O = N2O + C8H10
Quantity | Value | Units | Method | Reference | Comment |
---|---|---|---|---|---|
ΔrH° | -9.7 ± 0.4 | kJ/mol | Kin | Oth, Olsen, et al., 1977 | gas phase; At 426 K |
By formula: C8H10 = C8H10
Quantity | Value | Units | Method | Reference | Comment |
---|---|---|---|---|---|
ΔrH° | -0.58 ± 0.07 | kJ/mol | Eqk | Greathead and Orchard, 1983 | gas phase |

Gas phase ion energetics data

Data compiled as indicated in comments:
LLK - Sharon G. Lias, Rhoda D. Levin, and Sherif A. Kafafi
Ionization energy determinations
IE (eV) | Method | Reference | Comment |
---|---|---|---|
7.6 | PE | Gleiter, Gubernator, et al., 1981 | LLK |
8.25 | PE | Gleiter, Gubernator, et al., 1981 | Vertical value; LLK |

References

Roth, Adamczak, et al., 1991
Roth, W.R.; Adamczak, O.; Breuckmann, R.; Lennartz, H.-W.; Boese, R.,
Die Berechnung von Resonanzenergien; das MM2ERW-Kraftfeld,
Chem. Ber., 1991, 124, 2499-2521. [all data]
Greathead and Orchard, 1983
Greathead, J.M.; Orchard, S.W.,
Kinetic and equilibrium study of gas-phase interconversions of 1,3,6-cyclooctatriene, 1,3,5-cyclooctatriene and bicyclo[4.2.0]octa-2,4-diene,
Int. J. Chem. Kinet., 1983, 15, 1069-1080. [all data]
Turner, Goebel, et al., 1968
Turner, R.B.; Goebel, P.; Mallon, B.J.; Doering, W.E.; Coburn, J.F., Jr.; Pomerantz, M.,
Heats of hydrogenation. VIII. Compounds with three- and four-membered rings,
J. Am. Chem. Soc., 1968, 90, 4315-4322. [all data]
Oth, Olsen, et al., 1977
Oth, J.F.M.; Olsen, H.; Synder, J.P.,
Energetics of heteroextrusion reactions. N2 vs. N2O,
J. Am. Chem. Soc., 1977, 99, 8505-8507. [all data]
Gleiter, Gubernator, et al., 1981
Gleiter, R.; Gubernator, K.; Grimme, W.,
Evidence for a strong through-bond interaction in anti-tricyclo[6.4.0.02,7]dodecatetraene,
J. Org. Chem., 1981, 46, 1247. [all data]