2-Fluoropyridine
- Formula: C5H4FN
- Molecular weight: 97.0904
- IUPAC Standard InChIKey: MTAODLNXWYIKSO-UHFFFAOYSA-N
- CAS Registry Number: 372-48-5
- Chemical structure:
View 3d structure (requires JavaScript / HTML 5) - Other names: Pyridine, 2-fluoro-

Phase change data

Data compiled by: Robert L. Brown and Stephen E. Stein
Quantity | Value | Units | Method | Reference | Comment |
---|---|---|---|---|---|
Tboil | 398.2 | K | N/A | Weast and Grasselli, 1989 |
Reduced pressure boiling point
Tboil (K) | Pressure (bar) | Reference |
---|---|---|
399.2 | 1.00 | Aldrich Chemical Company Inc., 1990 |
399. | 1.00 | PCR Inc., 1990 |

Gas phase ion energetics data

Data evaluated as indicated in comments:
HL - Edward P. Hunter and Sharon G. Lias
Data compiled as indicated in comments:
LBLHLM - Sharon G. Lias, John E. Bartmess, Joel F. Liebman, John L. Holmes, Rhoda D. Levin, and W. Gary Mallard
Quantity | Value | Units | Method | Reference | Comment |
---|---|---|---|---|---|
Proton affinity (review) | 884.6 | kJ/mol | N/A | Hunter and Lias, 1998 | HL |
Quantity | Value | Units | Method | Reference | Comment |
Gas basicity | 852.7 | kJ/mol | N/A | Hunter and Lias, 1998 | HL |
Ionization energy determinations
IE (eV) | Method | Reference | Comment |
---|---|---|---|
9.4 | PE | Piancastelli, Keller, et al., 1983 | LBLHLM |

References

Weast and Grasselli, 1989
CRC Handbook of Data on Organic Compounds, 2nd Editon, Weast,R.C and Grasselli, J.G., ed(s)., CRC Press, Inc., Boca Raton, FL, 1989, 1. [all data]
Aldrich Chemical Company Inc., 1990
Aldrich Chemical Company Inc.,
Catalog Handbook of Fine Chemicals, Aldrich Chemical Company, Inc., Milwaukee WI, 1990, 1. [all data]
PCR Inc., 1990
PCR Inc.,
Research Chemicals Catalog 1990-1991, PCR Inc., Gainesville, FL, 1990, 1. [all data]
Hunter and Lias, 1998
Hunter, E.P.; Lias, S.G.,
Evaluated Gas Phase Basicities and Proton Affinities of Molecules: An Update,
J. Phys. Chem. Ref. Data, 1998, 27, 3, 413-656, https://doi.org/10.1063/1.556018
. [all data]
Piancastelli, Keller, et al., 1983
Piancastelli, M.N.; Keller, P.R.; Taylor, J.W.; Grimm, F.A.; Carlson, T.A.,
Angular distribution parameter as a function of photon energy for some mono- and diazabenzenes and its use for orbital assignment,
J. Am. Chem. Soc., 1983, 105, 4235. [all data]
Stephenson, 1954
Stephenson, H.P.,
Solution spectra and oscillator strengths of electronic transitions of pyridine and some monosubstituted derivatives,
J. Chem. Phys., 1954, 22, 6, 1077-1082. [all data]