Exo-5-chlorobicyclo[2.2.1]hept-2-ene
- Formula: C7H9Cl
- Molecular weight: 128.599
- IUPAC Standard InChIKey: PSCJIEZOAFAQRM-KPGICGJXSA-N
- CAS Registry Number: 3721-19-5
- Chemical structure:
View 3d structure (requires JavaScript / HTML 5) - Stereoisomers:

Gas phase ion energetics data

Data compiled by: Henry M. Rosenstock, Keith Draxl, Bruce W. Steiner, and John T. Herron
Ionization energy determinations
IE (eV) | Method | Reference |
---|---|---|
9.15 ± 0.15 | EI | Steele, Jennings, et al., 1965 |
Appearance energy determinations
Ion | AE (eV) | Other Products | Method | Reference | Comment |
---|---|---|---|---|---|
C5H6+ | 9.77 ± 0.15 | ? | EI | Steele, Jennings, et al., 1965 | |
C6H5+ | 13.0 ± 0.3 | ? | EI | Steele, Jennings, et al., 1965 | |
C6H7+ | 10.8 ± 0.15 | ? | EI | Steele, Jennings, et al., 1965 | |
C7H7+ | 12.6 ± 0.3 | ? | EI | Steele, Jennings, et al., 1965 | |
C7H9+ | 11.1 ± 0.15 | Cl | EI | Steele, Jennings, et al., 1965 |

References

Steele, Jennings, et al., 1965
Steele, W.C.; Jennings, B.H.; Botyos, G.L.; Dudek, G.O.,
An electron impact study of norbornenyl and nortricyclyl chlorides,
J. Org. Chem., 1965, 30, 2886. [all data]