1,3,5,2,4,6-Triazatriphosphorine, 2,4,6-trichloro-2,4,6-tris(dimethylamino)-2,2,4,4,6,6-hexahydro-
- Formula: C6H18Cl3N6P3
- Molecular weight: 373.528
- IUPAC Standard InChIKey: SASBNZJYFHIKRV-UHFFFAOYSA-N
- CAS Registry Number: 3721-13-9
- Chemical structure:
View 3d structure (requires JavaScript / HTML 5) - Permanent link for this species. Use this link for bookmarking this species for future reference.

Gas phase ion energetics data

Data compiled by: Sharon G. Lias, Rhoda D. Levin, and Sherif A. Kafafi
Ionization energy determinations
IE (eV) | Method | Reference |
---|---|---|
8.58 | EI | Clare and Sowerby, 1981 |

References

Clare and Sowerby, 1981
Clare, P.; Sowerby, D.B.,
Electron impact ionisation energies of some halo-cyclotriphosphazenes,
J. Inorg. Nucl. Chem., 1981, 43, 477. [all data]