Bis(trifluoromethyl)tetrasulfane
- Formula: C2F6S4
- Molecular weight: 266.272
- IUPAC Standard InChIKey: WAIPZXAWKMEBHT-UHFFFAOYSA-N
- CAS Registry Number: 372-07-6
- Chemical structure:
View 3d structure (requires JavaScript / HTML 5) - Other names: Hexafluorodimethyl tetrasulfide; Bis(trifluoromethyl)tetrasulfide

Gas phase ion energetics data

Data compiled by: Henry M. Rosenstock, Keith Draxl, Bruce W. Steiner, and John T. Herron
Ionization energy determinations
IE (eV) | Method | Reference |
---|---|---|
9.75 ± 0.03 | PE | Cullen, Frost, et al., 1969 |

References

Cullen, Frost, et al., 1969
Cullen, W.R.; Frost, D.C.; Vroom, D.A.,
Ionization potentials of some sulfur compounds,
Inorg. Chem., 1969, 8, 1803. [all data]