Trisulfide, bis(trifluoromethyl)
- Formula: C2F6S3
- Molecular weight: 234.207
- IUPAC Standard InChIKey: BHXPRVBRPHEPLQ-UHFFFAOYSA-N
- CAS Registry Number: 372-06-5
- Chemical structure:
View 3d structure (requires JavaScript / HTML 5) - Other names: Bis(trifluoromethyl)trisulfane; Di(methyl) trisulfide, perfluoro-

Gas phase ion energetics data

Data compiled by: Henry M. Rosenstock, Keith Draxl, Bruce W. Steiner, and John T. Herron
Ionization energy determinations
IE (eV) | Method | Reference |
---|---|---|
10.16 ± 0.03 | PE | Cullen, Frost, et al., 1969 |

References

Cullen, Frost, et al., 1969
Cullen, W.R.; Frost, D.C.; Vroom, D.A.,
Ionization potentials of some sulfur compounds,
Inorg. Chem., 1969, 8, 1803. [all data]