Methane, thiobis[trifluoro-
- Formula: C2F6S
- Molecular weight: 170.077
- IUPAC Standard InChIKey: OFHCXWMZXQBQMH-UHFFFAOYSA-N
- CAS Registry Number: 371-78-8
- Chemical structure:
View 3d structure (requires JavaScript / HTML 5) - Other names: Sulfide, bis(trifluoromethyl); Bis(trifluoromethyl) sulfide; Trifluoromethyl sulfide; Methane, thiobis*trifluoro-; Hexafluorodimethyl sulfide

Gas phase ion energetics data

Data compiled by: Henry M. Rosenstock, Keith Draxl, Bruce W. Steiner, and John T. Herron
Ionization energy determinations
IE (eV) | Method | Reference |
---|---|---|
11.28 ± 0.04 | EI | Cullen, Frost, et al., 1970 |
11.11 ± 0.03 | PE | Cullen, Frost, et al., 1969 |
Appearance energy determinations
Ion | AE (eV) | Other Products | Method | Reference | Comment |
---|---|---|---|---|---|
CF3+ | 12.54 ± 0.06 | ? | EI | Cullen, Frost, et al., 1970 | |
C2F5S+ | 15. | F | EI | Cullen, Frost, et al., 1970 |

References

Cullen, Frost, et al., 1970
Cullen, W.R.; Frost, D.C.; Pun, M.T.,
Mass spectra, appearance potentials, heats of formation, and bond energies of some alkyl and perfluoroalkyl sulfides,
Inorg. Chem., 1970, 9, 1976. [all data]
Cullen, Frost, et al., 1969
Cullen, W.R.; Frost, D.C.; Vroom, D.A.,
Ionization potentials of some sulfur compounds,
Inorg. Chem., 1969, 8, 1803. [all data]