Arsine, bis(trifluoromethyl)-
- Formula: C2HAsF6
- Molecular weight: 213.9414
- IUPAC Standard InChIKey: STJQTINJVVRXSU-UHFFFAOYSA-N
- CAS Registry Number: 371-74-4
- Chemical structure:
View 3d structure (requires JavaScript / HTML 5) - Other names: Bis(trifluoromethyl)arsine

Gas phase ion energetics data

Data compiled as indicated in comments:
LBLHLM - Sharon G. Lias, John E. Bartmess, Joel F. Liebman, John L. Holmes, Rhoda D. Levin, and W. Gary Mallard
RDSH - Henry M. Rosenstock, Keith Draxl, Bruce W. Steiner, and John T. Herron
Ionization energy determinations
IE (eV) | Method | Reference | Comment |
---|---|---|---|
10.5 | PE | Elbel, Dieck, et al., 1982 | LBLHLM |
10.9 ± 0.1 | EI | Cullen and Frost, 1962 | RDSH |
11.26 | PE | Elbel, Dieck, et al., 1982 | Vertical value; LBLHLM |

References

Elbel, Dieck, et al., 1982
Elbel, S.; Dieck, H.T.; Demuth, R.,
Photoelectron sSpectra of group V compounds. IX. The relative perfluoroalkyl substituent effect,
J. Fluorine Chem., 1982, 19, 349. [all data]
Cullen and Frost, 1962
Cullen, W.R.; Frost, D.C.,
Ionization potentials of some perfluoroalkyl arsines,
Can. J. Chem., 1962, 40, 390. [all data]