Bicyclo[2.2.1]hept-5-en-2-ol, 2-ethenyl-, (exo)-
- Formula: C9H12O
- Molecular weight: 136.1910
- IUPAC Standard InChIKey: YZIBFCLJXJRCHE-AMDVSUOASA-N
- CAS Registry Number: 37165-53-0
- Chemical structure:
View 3d structure (requires JavaScript / HTML 5) - Permanent link for this species. Use this link for bookmarking this species for future reference.

Gas phase ion energetics data

Data compiled by: Sharon G. Lias, John E. Bartmess, Joel F. Liebman, John L. Holmes, Rhoda D. Levin, and W. Gary Mallard
Appearance energy determinations
Ion | AE (eV) | Other Products | Method | Reference | Comment |
---|---|---|---|---|---|
C4H6O+ | 9.95 ± 0.05 | C5H6 | EI | Turecek and Havlas, 1986 | |
C5H6+ | 9.92 ± 0.05 | C4H6O | EI | Turecek and Havlas, 1986 |

References

Turecek and Havlas, 1986
Turecek, F.; Havlas, Z.,
Energy barriers to the diels-alder cycloadditions and cycloreversions of cation-radicals in the gas phase,
J. Chem. Soc. Perkin Trans. 2, 1986, 1011. [all data]